Reaction Details
TargetCarbonic anhydrase 1
LigandBDBM50174035
Substrate/Competitorn/a
Meas. Tech.ChEMBL_320717 (CHEMBL881703)
Ki 125±n/a nM
Citation Ozensoy, OPuccetti, LFasolis, GArslan, OScozzafava, ASupuran, CT Carbonic anhydrase inhibitors: inhibition of the tumor-associated isozymes IX and XII with a library of aromatic and heteroaromatic sulfonamides. Bioorg Med Chem Lett15:4862-6 (2005) 
 
Carbonic anhydrase 1
Name:Carbonic anhydrase 1
Type:Enzyme
Mol. Mass.:28873.37
Organism:Homo sapiens (Human)
Description:P00915
Residue:261
BDBM50174035
NameBDBM50174035
Synonyms:4-Methanesulfonylamino-benzenesulfonamide | CHEMBL193648
TypeSmall organic molecule
Emp. Form.C7H10N2O4S2
Mol. Mass.250.295
SMILESCS(=O)(=O)Nc1ccc(cc1)S(N)(=O)=O