Reaction Details
TargetCarbonic anhydrase 1
LigandBDBM50174037
Substrate/Competitorn/a
Meas. Tech.ChEMBL_320717 (CHEMBL881703)
Ki 37±n/a nM
Citation Ozensoy, OPuccetti, LFasolis, GArslan, OScozzafava, ASupuran, CT Carbonic anhydrase inhibitors: inhibition of the tumor-associated isozymes IX and XII with a library of aromatic and heteroaromatic sulfonamides. Bioorg Med Chem Lett15:4862-6 (2005) 
 
Carbonic anhydrase 1
Name:Carbonic anhydrase 1
Type:Enzyme
Mol. Mass.:28873.37
Organism:Homo sapiens (Human)
Description:P00915
Residue:261
BDBM50174037
NameBDBM50174037
Synonyms:4-{2-[3-(4-Sulfamoyl-cyclohexa-1,5-dienyl)-thioureido]-ethyl}-benzenesulfonamide | CHEMBL365558
TypeSmall organic molecule
Emp. Form.C15H18N4O4S3
Mol. Mass.414.523
SMILESNS(=O)(=O)c1ccc(CCNC(=S)Nc2ccc(cc2)S(N)(=O)=O)cc1