Reaction Details
TargetCarbonic anhydrase 2
LigandBDBM50174040
Substrate/Competitorn/a
Meas. Tech.ChEMBL_320718 (CHEMBL881704)
Ki 12±n/a nM
Citation Ozensoy, OPuccetti, LFasolis, GArslan, OScozzafava, ASupuran, CT Carbonic anhydrase inhibitors: inhibition of the tumor-associated isozymes IX and XII with a library of aromatic and heteroaromatic sulfonamides. Bioorg Med Chem Lett15:4862-6 (2005) 
 
Carbonic anhydrase 2
Name:Carbonic anhydrase 2
Type:Enzyme
Mol. Mass.:29250.71
Organism:Homo sapiens (Human)
Description:P00918
Residue:260
BDBM50174040
NameBDBM50174040
Synonyms:4-[(3-Phenyl-thioureido)-methyl]-benzenesulfonamide | CHEMBL194350
TypeSmall organic molecule
Emp. Form.C14H15N3O2S2
Mol. Mass.321.418
SMILESNS(=O)(=O)c1ccc(CNC(=S)Nc2ccccc2)cc1