Reaction Details
TargetCarbonic anhydrase 12
LigandBDBM50174035
Substrate/Competitorn/a
Meas. Tech.ChEMBL_320720 (CHEMBL881706)
Ki 33±n/a nM
Citation Ozensoy, OPuccetti, LFasolis, GArslan, OScozzafava, ASupuran, CT Carbonic anhydrase inhibitors: inhibition of the tumor-associated isozymes IX and XII with a library of aromatic and heteroaromatic sulfonamides. Bioorg Med Chem Lett15:4862-6 (2005) 
 
Carbonic anhydrase 12
Name:Carbonic anhydrase 12
Type:Enzyme
Mol. Mass.:39456.00
Organism:Homo sapiens (Human)
Description:Catalytic domain of human cloned isozyme was used in the assay
Residue:354
BDBM50174035
NameBDBM50174035
Synonyms:4-Methanesulfonylamino-benzenesulfonamide | CHEMBL193648
TypeSmall organic molecule
Emp. Form.C7H10N2O4S2
Mol. Mass.250.295
SMILESCS(=O)(=O)Nc1ccc(cc1)S(N)(=O)=O