Reaction Details
TargetCarbonic anhydrase 1
LigandBDBM50174038
Substrate/Competitorn/a
Meas. Tech.ChEMBL_320717 (CHEMBL881703)
Ki 290±n/a nM
Citation Ozensoy, OPuccetti, LFasolis, GArslan, OScozzafava, ASupuran, CT Carbonic anhydrase inhibitors: inhibition of the tumor-associated isozymes IX and XII with a library of aromatic and heteroaromatic sulfonamides. Bioorg Med Chem Lett15:4862-6 (2005) 
 
Carbonic anhydrase 1
Name:Carbonic anhydrase 1
Type:Enzyme
Mol. Mass.:28873.37
Organism:Homo sapiens (Human)
Description:P00915
Residue:261
BDBM50174038
NameBDBM50174038
Synonyms:CHEMBL197412 | Furan-2-carboxylic acid (5-sulfamoyl-3H-[1,3,4]thiadiazol-2-ylidene)-amide
TypeSmall organic molecule
Emp. Form.C7H6N4O4S2
Mol. Mass.274.277
SMILESNS(=O)(=O)c1nnc(NC(=O)c2ccco2)s1