Reaction Details
TargetCarbonic anhydrase 2
LigandBDBM50174036
Substrate/Competitorn/a
Meas. Tech.ChEMBL_320718 (CHEMBL881704)
Ki 100±n/a nM
Citation Ozensoy, OPuccetti, LFasolis, GArslan, OScozzafava, ASupuran, CT Carbonic anhydrase inhibitors: inhibition of the tumor-associated isozymes IX and XII with a library of aromatic and heteroaromatic sulfonamides. Bioorg Med Chem Lett15:4862-6 (2005) 
 
Carbonic anhydrase 2
Name:Carbonic anhydrase 2
Type:Enzyme
Mol. Mass.:29250.71
Organism:Homo sapiens (Human)
Description:P00918
Residue:260
BDBM50174036
NameBDBM50174036
Synonyms:4-Chloro-6-(3-phenyl-ureido)-benzene-1,3-disulfonic acid diamide | CHEMBL363168
TypeSmall organic molecule
Emp. Form.C13H13ClN4O5S2
Mol. Mass.404.849
SMILESNS(=O)(=O)c1cc(c(NC(=O)Nc2ccccc2)cc1Cl)S(N)(=O)=O