Reaction Details
TargetCarbonic anhydrase 1
LigandBDBM16646
Substrate/Competitorn/a
Meas. Tech.ChEMBL_320717 (CHEMBL881703)
Ki 19300±n/a nM
Citation Ozensoy, OPuccetti, LFasolis, GArslan, OScozzafava, ASupuran, CT Carbonic anhydrase inhibitors: inhibition of the tumor-associated isozymes IX and XII with a library of aromatic and heteroaromatic sulfonamides. Bioorg Med Chem Lett15:4862-6 (2005) 
 
Carbonic anhydrase 1
Name:Carbonic anhydrase 1
Type:Enzyme
Mol. Mass.:28873.37
Organism:Homo sapiens (Human)
Description:P00915
Residue:261
BDBM16646
NameBDBM16646
Synonyms:4-n-Butanamido-benzenesulfonamide N-(4-sulfamoylphenyl)butanamide | aromatic sulfonamide compound 11
TypeSmall organic molecule
Emp. Form.C10H14N2O3S
Mol. Mass.242.295
SMILESCCCC(=O)Nc1ccc(cc1)S(N)(=O)=O