Reaction Details
TargetCarbonic anhydrase 12
LigandBDBM16647
Substrate/Competitorn/a
Meas. Tech.ChEMBL_320720 (CHEMBL881706)
Ki 138±n/a nM
Citation Ozensoy, OPuccetti, LFasolis, GArslan, OScozzafava, ASupuran, CT Carbonic anhydrase inhibitors: inhibition of the tumor-associated isozymes IX and XII with a library of aromatic and heteroaromatic sulfonamides. Bioorg Med Chem Lett15:4862-6 (2005) 
 
Carbonic anhydrase 12
Name:Carbonic anhydrase 12
Type:Enzyme
Mol. Mass.:39456.00
Organism:Homo sapiens (Human)
Description:Catalytic domain of human cloned isozyme was used in the assay
Residue:354
BDBM16647
NameBDBM16647
Synonyms:2-methyl-N-(4-sulfamoylphenyl)propanamide CHEMBL23417 | aromatic sulfonamide compound 12
TypeSmall organic molecule
Emp. Form.C10H14N2O3S
Mol. Mass.242.295
SMILESCC(C)C(=O)Nc1ccc(cc1)S(N)(=O)=O