Reaction Details
TargetPhenylethanolamine N-methyltransferase
LigandBDBM50077543
Substrate/Competitorn/a
Meas. Tech.ChEMBL_326878 (CHEMBL862979)
Ki 72±n/a nM
Citation Grunewald, GLLu, JCriscione, KROkoro, CO Inhibitors of phenylethanolamine N-methyltransferase devoid of alpha2-adrenoceptor affinity. Bioorg Med Chem Lett15:5319-23 (2005) 
 
Phenylethanolamine N-methyltransferase
Name:Phenylethanolamine N-methyltransferase
Type:Enzyme
Mol. Mass.:30852.66
Organism:Homo sapiens (Human)
Description:n/a
Residue:282
BDBM50077543
NameBDBM50077543
Synonyms:3-Methyl-7-nitro-1,2,3,4-tetrahydro-isoquinoline CHEMBL59719
TypeSmall organic molecule
Emp. Form.C10H12N2O2
Mol. Mass.192.2145
SMILESCC1Cc2ccc(cc2CN1)[N+]([O-])=O