Reaction Details
TargetRibonucleoside-diphosphate reductase large subunit/subunit M2/subunit M2 B
LigandBDBM50174197
Substrate/Competitorn/a
Meas. Tech.ChEMBL_325982 (CHEMBL869398)
IC50 40000±n/a nM
Citation Fuertes, MJKaur, JDeb, PCooperman, BSSmith, AB Design, synthesis, and evaluation of octahydropyranopyrrole-based inhibitors of mammalian ribonucleotide reductase. Bioorg Med Chem Lett15:5146-9 (2005) 
 
Ribonucleoside-diphosphate reductase large subunit/subunit M2/subunit M2 B
Name:Ribonucleoside-diphosphate reductase large subunit/subunit M2/subunit M2 B
Synonyms:Ribonucleoside-diphosphate reductase M1 chain/Ribonucleoside-diphosphate reductase M2 chain/Ribonucleotide reductase
Type:n/a
Mol. Mass.:n/a
Description:ASSAY_ID of EBI is 325982
Components:This complex has 3 components.
Component 1
Name:Ribonucleoside-diphosphate reductase large subunit
Type:PROTEIN
Mol. Mass.:90074.67
Organism:Homo sapiens (Human)
Description:ChEMBL_90946
Residue:792
Component 2
Name:Ribonucleoside-diphosphate reductase subunit M2 B
Synonyms:P53R2 RRM2B Ribonucleotide reductase p53-inducible ribonucleotide reductase small subunit 2-like protein
Type:PROTEIN
Mol. Mass.:40721.91
Organism:Homo sapiens (Human)
Description:EBI_318
Residue:351
Component 3
Name:Ribonucleoside-diphosphate reductase subunit M2
Synonyms:RIR2_HUMAN RRM2 Ribonucleotide reductase small chain | Ribonucleotide reductase small subunit
Type:PROTEIN
Mol. Mass.:44868.59
Organism:Homo sapiens (Human)
Description:ChEMBL_195255
Residue:389
BDBM50174197
NameBDBM50174197
Synonyms:(S)-3-(2-((3S,3aR,5S,7S,7aS)-7-((3-(9H-fluoren-9-yl)propanoyloxy)methyl)-3-hydroxy-5-isobutoxy-hexahydropyrano[3,4-b]pyrrol-1(2H)-yl)acetamido)-4-((S)-1-carboxy-2-phenylethylamino)-4-oxobutanoic acid | CHEMBL425572
TypeSmall organic molecule
Emp. Form.C43H51N3O11
Mol. Mass.785.8785
SMILESCC(C)CO[C@@H]1C[C@H]2[C@H](O)CN(CC(=O)N[C@@H](CC(O)=O)C(=O)N[C@@H](Cc3ccccc3)C(O)=O)[C@@H]2[C@@H](COC(=O)CCC2c3ccccc3-c3ccccc23)O1