Reaction Details
TargetProstaglandin D2 receptor
LigandBDBM50174354
Substrate/Competitorn/a
Meas. Tech.ChEMBL_320830 (CHEMBL871672)
Ki 1872±n/a nM
Citation Armer, REAshton, MRBoyd, EABrennan, CJBrookfield, FAGazi, LGyles, SLHay, PAHunter, MGMiddlemiss, DWhittaker, MXue, LPettipher, R Indole-3-acetic acid antagonists of the prostaglandin D2 receptor CRTH2. J Med Chem48:6174-7 (2005) 
 
Prostaglandin D2 receptor
Name:Prostaglandin D2 receptor
Type:Enzyme
Mol. Mass.:40288.87
Organism:Homo sapiens (Human)
Description:Q13258
Residue:359
BDBM50174354
NameBDBM50174354
Synonyms:CHEMBL373294 | [1-(2,5-Dichloro-benzenesulfonyl)-5-fluoro-2-methyl-1H-indol-3-yl]-acetic acid
TypeSmall organic molecule
Emp. Form.C17H12Cl2FNO4S
Mol. Mass.416.251
SMILESCc1c(CC(O)=O)c2cc(F)ccc2n1S(=O)(=O)c1cc(Cl)ccc1Cl