Reaction Details
TargetProstaglandin D2 receptor
LigandBDBM50174360
Substrate/Competitorn/a
Meas. Tech.ChEMBL_320830 (CHEMBL871672)
Ki 7710±n/a nM
Citation Armer, REAshton, MRBoyd, EABrennan, CJBrookfield, FAGazi, LGyles, SLHay, PAHunter, MGMiddlemiss, DWhittaker, MXue, LPettipher, R Indole-3-acetic acid antagonists of the prostaglandin D2 receptor CRTH2. J Med Chem48:6174-7 (2005) 
 
Prostaglandin D2 receptor
Name:Prostaglandin D2 receptor
Type:Enzyme
Mol. Mass.:40288.87
Organism:Homo sapiens (Human)
Description:Q13258
Residue:359
BDBM50174360
NameBDBM50174360
Synonyms:CHEMBL364299 | [5-Fluoro-1-(4-methoxy-benzenesulfonyl)-2-methyl-1H-indol-3-yl]-acetic acid
TypeSmall organic molecule
Emp. Form.C18H16FNO5S
Mol. Mass.377.387
SMILESCOc1ccc(cc1)S(=O)(=O)n1c(C)c(CC(O)=O)c2cc(F)ccc12