Reaction Details
TargetRetinoic acid receptor gamma
LigandBDBM31892
Substrate/Competitorn/a
Meas. Tech.ChEMBL_320732 (CHEMBL880877)
Kd 0.8±n/a nM
Citation Sussman, Fde Lera, AR Ligand recognition by RAR and RXR receptors: binding and selectivity. J Med Chem48:6212-9 (2005) 
 
Retinoic acid receptor gamma
Name:Retinoic acid receptor gamma
Type:PROTEIN
Mol. Mass.:50345.43
Organism:Homo sapiens (Human)
Description:ChEMBL_1458016
Residue:454
BDBM31892
NameBDBM31892
Synonyms:9-cis retinoic acid CHEMBL705 alitretinoin
TypeSmall organic molecule
Emp. Form.C20H28O2
Mol. Mass.300.4351
SMILESC\C(\C=C\C1=C(C)CCCC1(C)C)=C\C=C\C(\C)=C\C(O)=O