Reaction Details
Target5-hydroxytryptamine receptor 4
LigandBDBM50174416
Substrate/Competitorn/a
Meas. Tech.ChEMBL_320933 (CHEMBL882452)
Ki 6±n/a nM
Citation Soulier, JLRusso, OGiner, MRivail, LBerthouze, MOngeri, SMaigret, BFischmeister, RLezoualc'h, FSicsic, SBerque-Bestel, I Design and synthesis of specific probes for human 5-HT4 receptor dimerization studies. J Med Chem48:6220-8 (2005) 
 
5-hydroxytryptamine receptor 4
Name:5-hydroxytryptamine receptor 4
Type:Enzyme
Mol. Mass.:43767.54
Organism:Homo sapiens (Human)
Description:Q13639
Residue:388
BDBM50174416
NameBDBM50174416
Synonyms:1-[2-(4-amino-5-chloro-2-methoxyphenylcarbonyloxy)ethyl]-4-{2-[2-(3-{1-[2-(4-amino-5-chloro-2-methoxyphenylcarbonyloxy)ethyl]hexahydro-4-pyridinylcarboxamido}propoxy)ethoxy]ethoxymethylcarbamoyl}hexahydropyridine | CHEMBL370796
TypeSmall organic molecule
Emp. Form.C40H58Cl2N6O11
Mol. Mass.869.828
SMILESCOc1cc(N)c(Cl)cc1C(=O)OCCN1CCC(CC1)C(=O)NCCCOCCOCCOCNC(=O)C1CCN(CCOC(=O)c2cc(Cl)c(N)cc2OC)CC1