Reaction Details
Target5-hydroxytryptamine receptor 4
LigandBDBM50174433
Substrate/Competitorn/a
Meas. Tech.ChEMBL_320933 (CHEMBL882452)
Ki 14±n/a nM
Citation Soulier, JLRusso, OGiner, MRivail, LBerthouze, MOngeri, SMaigret, BFischmeister, RLezoualc'h, FSicsic, SBerque-Bestel, I Design and synthesis of specific probes for human 5-HT4 receptor dimerization studies. J Med Chem48:6220-8 (2005) 
 
5-hydroxytryptamine receptor 4
Name:5-hydroxytryptamine receptor 4
Type:Enzyme
Mol. Mass.:43767.54
Organism:Homo sapiens (Human)
Description:Q13639
Residue:388
BDBM50174433
NameBDBM50174433
Synonyms:1-[2-(4-amino-5-chloro-2-methoxyphenylcarbonyloxy)ethyl]-4-[10-(1-benzylhexahydro-4-pyridinylcarbamoyl)decylcarboxamido]hexahydropyridine | CHEMBL198504
TypeSmall organic molecule
Emp. Form.C39H58ClN5O5
Mol. Mass.712.361
SMILESCOc1cc(N)c(Cl)cc1C(=O)OCCN1CCC(CC1)NC(=O)CCCCCCCCCCC(=O)NC1CCN(Cc2ccccc2)CC1