Reaction Details
Target5-hydroxytryptamine receptor 4
LigandBDBM50174434
Substrate/Competitorn/a
Meas. Tech.ChEMBL_320933 (CHEMBL882452)
Ki 7±n/a nM
Citation Soulier, JLRusso, OGiner, MRivail, LBerthouze, MOngeri, SMaigret, BFischmeister, RLezoualc'h, FSicsic, SBerque-Bestel, I Design and synthesis of specific probes for human 5-HT4 receptor dimerization studies. J Med Chem48:6220-8 (2005) 
 
5-hydroxytryptamine receptor 4
Name:5-hydroxytryptamine receptor 4
Type:Enzyme
Mol. Mass.:43767.54
Organism:Homo sapiens (Human)
Description:Q13639
Residue:388
BDBM50174434
NameBDBM50174434
Synonyms:1-[2-(4-amino-5-chloro-2-hydroxyphenylcarbonyloxy)ethyl]-4-(5-{1-[2-(4-amino-5-chloro-2-methoxyphenylcarbonyloxy)ethyl]hexahydro-4-pyridinylcarboxamido}pentylcarboxamido)hexahydropyridine | CHEMBL198719
TypeSmall organic molecule
Emp. Form.C36H50Cl2N6O8
Mol. Mass.765.724
SMILESCOc1cc(N)c(Cl)cc1C(=O)OCCN1CCC(CC1)C(=O)NCCCCCC(=O)NC1CCN(CCOC(=O)c2cc(Cl)c(N)cc2O)CC1