Reaction Details
TargetAdenosine kinase
LigandBDBM50090883
Substrate/Competitorn/a
Meas. Tech.ChEMBL_321616 (CHEMBL872316)
IC50 0.8±n/a nM
Citation Boyer, SHUgarkar, BGSolbach, JKopcho, JMatelich, MCOllis, KGomez-Galeno, JEMendonca, RTsuchiya, MNagahisa, ANakane, MWiesner, JBErion, MD Adenosine kinase inhibitors. 5. Synthesis, enzyme inhibition, and analgesic activity of diaryl-erythro-furanosyltubercidin analogues. J Med Chem48:6430-41 (2005) 
 
Adenosine kinase
Name:Adenosine kinase
Type:PROTEIN
Mol. Mass.:40545.97
Organism:Homo sapiens (Human)
Description:ChEMBL_1467841
Residue:362
BDBM50090883
NameBDBM50090883
Synonyms:(1R,4S,5R)-2-Hydroxymethyl-5-(5-phenyl-4-phenylamino-pyrrolo[2,3-d]pyrimidin-7-yl)-tetrahydro-furan-3,4-diol CHEMBL319315
TypeSmall organic molecule
Emp. Form.C23H22N4O4
Mol. Mass.418.4452
SMILESOC[C@H]1O[C@H]([C@H](O)[C@@H]1O)n1cc(-c2ccccc2)c2c(Nc3ccccc3)ncnc12