Reaction Details
TargetHistamine H3 receptor
LigandBDBM50174636
Substrate/Competitorn/a
Meas. Tech.ChEMBL_320916 (CHEMBL881343)
Ki 0.31±n/a nM
Citation Sun, MZhao, CGfesser, GAThiffault, CMiller, TRMarsh, KWetter, JCurtis, MFaghih, REsbenshade, TAHancock, AACowart, M Synthesis and SAR of 5-amino- and 5-(aminomethyl)benzofuran histamine H3 receptor antagonists with improved potency. J Med Chem48:6482-90 (2005) 
 
Histamine H3 receptor
Name:Histamine H3 receptor
Type:G Protein-Coupled Receptor (GPCR)
Mol. Mass.:48691.47
Organism:Homo sapiens (Human)
Description:Binding assays were using CHO cells stably expressing hH3R receptors.
Residue:445
BDBM50174636
NameBDBM50174636
Synonyms:CHEMBL198703 | {2-[2-((R)-2-Methyl-pyrrolidin-1-yl)-ethyl]-benzofuran-5-yl}-pyrimidin-2-yl-amine
TypeSmall organic molecule
Emp. Form.C19H22N4O
Mol. Mass.322.4042
SMILESC[C@@H]1CCCN1CCc1cc2cc(Nc3ncccn3)ccc2o1