Reaction Details
TargetVascular endothelial growth factor receptor 2
LigandBDBM50174686
Substrate/Competitorn/a
Meas. Tech.ChEMBL_326669 (CHEMBL867552)
IC50 9500±n/a nM
Citation Pan, WLiu, HXu, YJChen, XKim, KHMilligan, DLColumbus, JHadari, YRKussie, PWong, WCLabelle, M Pyrimido-oxazepine as a versatile template for the development of inhibitors of specific kinases. Bioorg Med Chem Lett15:5474-7 (2005) 
 
Vascular endothelial growth factor receptor 2
Name:Vascular endothelial growth factor receptor 2
Type:Receptor Tyrosine Kinase
Mol. Mass.:151510.97
Organism:Homo sapiens (Human)
Description:P35968
Residue:1356
BDBM50174686
NameBDBM50174686
Synonyms:1-(1-chloro-5-oxa-2,4,11-triaza-dibenzo[a,d]cyclohepten-8-yl)-3-(4-chloro-3-trifluoromethyl-phenyl)-urea | CHEMBL199886
TypeSmall organic molecule
Emp. Form.C19H10Cl2F3N5O2
Mol. Mass.468.216
SMILESFC(F)(F)c1cc(NC(=O)Nc2ccc3Oc4ncnc(Cl)c4N=Cc3c2)ccc1Cl