Reaction Details
TargetReceptor-type tyrosine-protein kinase FLT3
LigandBDBM50174701
Substrate/Competitorn/a
Meas. Tech.ChEMBL_326667 (CHEMBL868730)
IC50 900±n/a nM
Citation Pan, WLiu, HXu, YJChen, XKim, KHMilligan, DLColumbus, JHadari, YRKussie, PWong, WCLabelle, M Pyrimido-oxazepine as a versatile template for the development of inhibitors of specific kinases. Bioorg Med Chem Lett15:5474-7 (2005) 
 
Receptor-type tyrosine-protein kinase FLT3
Name:Receptor-type tyrosine-protein kinase FLT3
Type:Enzyme
Mol. Mass.:112888.62
Organism:Homo sapiens (Human)
Description:P36888
Residue:993
BDBM50174701
NameBDBM50174701
Synonyms:1-(3-chloro-10,11-dihydro-5-oxa-2,4,11-triaza-dibenzo[a,d]cyclohepten-8-yl)-3-(4-chloro-3-trifluoromethyl-phenyl)-urea | CHEMBL382490
TypeSmall organic molecule
Emp. Form.C19H12Cl2F3N5O2
Mol. Mass.470.232
SMILESFC(F)(F)c1cc(NC(=O)Nc2ccc3Oc4nc(Cl)ncc4NCc3c2)ccc1Cl