Reaction Details
TargetSodium-dependent dopamine transporter
LigandBDBM50174847
Substrate/Competitorn/a
Meas. Tech.ChEMBL_326652 (CHEMBL870557)
IC50 603±n/a nM
Citation Krunic, AMariappan, SVReith, MEDunn, WJ Synthesis and monoamine transporter affinity of 3-aryl substituted trop-2-enes. Bioorg Med Chem Lett15:5488-93 (2005) 
 
Sodium-dependent dopamine transporter
Name:Sodium-dependent dopamine transporter
Type:Multi-pass membrane protein
Mol. Mass.:68497.11
Organism:Homo sapiens (Human)
Description:Q01959
Residue:620
BDBM50174847
NameBDBM50174847
Synonyms:3-(1H-indol-3-yl)-8-methyl-8-aza-bicyclo[3.2.1]oct-2-ene CHEMBL371726
TypeSmall organic molecule
Emp. Form.C16H18N2
Mol. Mass.238.3275
SMILESCN1C2CCC1C=C(C2)c1c[nH]c2ccccc12