Reaction Details
TargetMu-type opioid receptor
LigandBDBM50174949
Substrate/Competitorn/a
Meas. Tech.ChEMBL_325673 (CHEMBL863227)
Ki>5000±n/a nM
Citation Chu, GHGu, MCassel, JABelanger, SGraczyk, TMDeHaven, RNConway-James, NKoblish, MLittle, PJDeHaven-Hudkins, DLDolle, RE Potent and highly selective kappa opioid receptor agonists incorporating chroman- and 2,3-dihydrobenzofuran-based constraints. Bioorg Med Chem Lett15:5114-9 (2005) 
 
Mu-type opioid receptor
Name:Mu-type opioid receptor
Type:G Protein-Coupled Receptor (GPCR)
Mol. Mass.:44789.51
Organism:Homo sapiens (Human)
Description:P35372
Residue:400
BDBM50174949
NameBDBM50174949
Synonyms:CHEMBL371685 | N-((S)-2-((S)-3-hydroxypyrrolidin-1-yl)-1-phenylethyl)-N-methyl-6-(methylsulfonamido)chroman-2-carboxamide
TypeSmall organic molecule
Emp. Form.C24H31N3O5S
Mol. Mass.473.585
SMILESCN([C@H](CN1CC[C@H](O)C1)c1ccccc1)C(=O)C1CCc2cc(NS(C)(=O)=O)ccc2O1