Reaction Details
TargetKappa-type opioid receptor
LigandBDBM50174950
Substrate/Competitorn/a
Meas. Tech.ChEMBL_325672 (CHEMBL863226)
Ki 3.3±n/a nM
Citation Chu, GHGu, MCassel, JABelanger, SGraczyk, TMDeHaven, RNConway-James, NKoblish, MLittle, PJDeHaven-Hudkins, DLDolle, RE Potent and highly selective kappa opioid receptor agonists incorporating chroman- and 2,3-dihydrobenzofuran-based constraints. Bioorg Med Chem Lett15:5114-9 (2005) 
 
Kappa-type opioid receptor
Name:Kappa-type opioid receptor
Type:G Protein-Coupled Receptor (GPCR)
Mol. Mass.:42648.76
Organism:Homo sapiens (Human)
Description:P41145
Residue:380
BDBM50174950
NameBDBM50174950
Synonyms:6-Sulfamoyl-chroman-2-carboxylic acid [(S)-2-((S)-3-hydroxy-pyrrolidin-1-yl)-1-phenyl-ethyl]-methyl-amide | CHEMBL197123
TypeSmall organic molecule
Emp. Form.C23H29N3O5S
Mol. Mass.459.558
SMILESCN([C@H](CN1CC[C@H](O)C1)c1ccccc1)C(=O)C1CCc2cc(ccc2O1)S(N)(=O)=O