Reaction Details
TargetCytochrome P450 2D6
LigandBDBM50174955
Substrate/Competitorn/a
Meas. Tech.ChEMBL_325677 (CHEMBL863231)
IC50 760±n/a nM
Citation Chu, GHGu, MCassel, JABelanger, SGraczyk, TMDeHaven, RNConway-James, NKoblish, MLittle, PJDeHaven-Hudkins, DLDolle, RE Potent and highly selective kappa opioid receptor agonists incorporating chroman- and 2,3-dihydrobenzofuran-based constraints. Bioorg Med Chem Lett15:5114-9 (2005) 
 
Cytochrome P450 2D6
Name:Cytochrome P450 2D6
Type:Protein
Mol. Mass.:55774.82
Organism:Homo sapiens (Human)
Description:P10635
Residue:497
BDBM50174955
NameBDBM50174955
Synonyms:(S)-N-((S)-2-((S)-3-hydroxypyrrolidin-1-yl)-1-phenylethyl)-N-methyl-2,3-dihydrobenzofuran-2-carboxamide | CHEMBL380991
TypeSmall organic molecule
Emp. Form.C22H26N2O3
Mol. Mass.366.4534
SMILESCN([C@H](CN1CC[C@H](O)C1)c1ccccc1)C(=O)[C@@H]1Cc2ccccc2O1