Reaction Details
TargetKappa-type opioid receptor
LigandBDBM50174962
Substrate/Competitorn/a
Meas. Tech.ChEMBL_325672 (CHEMBL863226)
Ki 5.8±n/a nM
Citation Chu, GHGu, MCassel, JABelanger, SGraczyk, TMDeHaven, RNConway-James, NKoblish, MLittle, PJDeHaven-Hudkins, DLDolle, RE Potent and highly selective kappa opioid receptor agonists incorporating chroman- and 2,3-dihydrobenzofuran-based constraints. Bioorg Med Chem Lett15:5114-9 (2005) 
 
Kappa-type opioid receptor
Name:Kappa-type opioid receptor
Type:G Protein-Coupled Receptor (GPCR)
Mol. Mass.:42648.76
Organism:Homo sapiens (Human)
Description:P41145
Residue:380
BDBM50174962
NameBDBM50174962
Synonyms:CHEMBL197126 | methyl (S)-2-(((S)-2-((S)-3-hydroxypyrrolidin-1-yl)-1-phenylethyl)(methyl)carbamoyl)-2,3-dihydrobenzofuran-5-ylcarbamate
TypeSmall organic molecule
Emp. Form.C24H29N3O5
Mol. Mass.439.5042
SMILESCOC(=O)Nc1ccc2O[C@@H](Cc2c1)C(=O)N(C)[C@H](CN1CC[C@H](O)C1)c1ccccc1