Reaction Details
TargetCytochrome P450 2D6
LigandBDBM50174966
Substrate/Competitorn/a
Meas. Tech.ChEMBL_325677 (CHEMBL863231)
IC50 320±n/a nM
Citation Chu, GHGu, MCassel, JABelanger, SGraczyk, TMDeHaven, RNConway-James, NKoblish, MLittle, PJDeHaven-Hudkins, DLDolle, RE Potent and highly selective kappa opioid receptor agonists incorporating chroman- and 2,3-dihydrobenzofuran-based constraints. Bioorg Med Chem Lett15:5114-9 (2005) 
 
Cytochrome P450 2D6
Name:Cytochrome P450 2D6
Type:Protein
Mol. Mass.:55774.82
Organism:Homo sapiens (Human)
Description:P10635
Residue:497
BDBM50174966
NameBDBM50174966
Synonyms:6-Methylsulfamoyl-chroman-2-carboxylic acid [(S)-2-((S)-3-hydroxy-pyrrolidin-1-yl)-1-phenyl-ethyl]-methyl-amide | CHEMBL199111
TypeSmall organic molecule
Emp. Form.C24H31N3O5S
Mol. Mass.473.585
SMILESCNS(=O)(=O)c1ccc2OC(CCc2c1)C(=O)N(C)[C@H](CN1CC[C@H](O)C1)c1ccccc1