Reaction Details
TargetKappa-type opioid receptor
LigandBDBM50174967
Substrate/Competitorn/a
Meas. Tech.ChEMBL_325672 (CHEMBL863226)
Ki 1.3±n/a nM
Citation Chu, GHGu, MCassel, JABelanger, SGraczyk, TMDeHaven, RNConway-James, NKoblish, MLittle, PJDeHaven-Hudkins, DLDolle, RE Potent and highly selective kappa opioid receptor agonists incorporating chroman- and 2,3-dihydrobenzofuran-based constraints. Bioorg Med Chem Lett15:5114-9 (2005) 
 
Kappa-type opioid receptor
Name:Kappa-type opioid receptor
Type:G Protein-Coupled Receptor (GPCR)
Mol. Mass.:42648.76
Organism:Homo sapiens (Human)
Description:P41145
Residue:380
BDBM50174967
NameBDBM50174967
Synonyms:(R)-N-((S)-2-((S)-3-hydroxypyrrolidin-1-yl)-1-phenylethyl)-N-methyl-5-(methylsulfonamido)-2,3-dihydrobenzofuran-2-carboxamide | CHEMBL434933
TypeSmall organic molecule
Emp. Form.C23H29N3O5S
Mol. Mass.459.558
SMILESCN([C@H](CN1CC[C@H](O)C1)c1ccccc1)C(=O)[C@H]1Cc2cc(NS(C)(=O)=O)ccc2O1