Reaction Details
TargetCytochrome P450 2D6
LigandBDBM50174959
Substrate/Competitorn/a
Meas. Tech.ChEMBL_325677 (CHEMBL863231)
IC50 14000±n/a nM
Citation Chu, GHGu, MCassel, JABelanger, SGraczyk, TMDeHaven, RNConway-James, NKoblish, MLittle, PJDeHaven-Hudkins, DLDolle, RE Potent and highly selective kappa opioid receptor agonists incorporating chroman- and 2,3-dihydrobenzofuran-based constraints. Bioorg Med Chem Lett15:5114-9 (2005) 
 
Cytochrome P450 2D6
Name:Cytochrome P450 2D6
Type:Protein
Mol. Mass.:55774.82
Organism:Homo sapiens (Human)
Description:P10635
Residue:497
BDBM50174959
NameBDBM50174959
Synonyms:CHEMBL196813 | methyl ((S)-2-(((S)-2-((S)-3-hydroxypyrrolidin-1-yl)-1-phenylethyl)(methyl)carbamoyl)chroman-6-yl)methylcarbamate
TypeSmall organic molecule
Emp. Form.C26H33N3O5
Mol. Mass.467.5573
SMILESCOC(=O)NCc1ccc2O[C@@H](CCc2c1)C(=O)N(C)[C@H](CN1CC[C@H](O)C1)c1ccccc1