Reaction Details
TargetCytochrome P450 2D6
LigandBDBM50174950
Substrate/Competitorn/a
Meas. Tech.ChEMBL_325677 (CHEMBL863231)
IC50 1800±n/a nM
Citation Chu, GHGu, MCassel, JABelanger, SGraczyk, TMDeHaven, RNConway-James, NKoblish, MLittle, PJDeHaven-Hudkins, DLDolle, RE Potent and highly selective kappa opioid receptor agonists incorporating chroman- and 2,3-dihydrobenzofuran-based constraints. Bioorg Med Chem Lett15:5114-9 (2005) 
 
Cytochrome P450 2D6
Name:Cytochrome P450 2D6
Type:Protein
Mol. Mass.:55774.82
Organism:Homo sapiens (Human)
Description:P10635
Residue:497
BDBM50174950
NameBDBM50174950
Synonyms:6-Sulfamoyl-chroman-2-carboxylic acid [(S)-2-((S)-3-hydroxy-pyrrolidin-1-yl)-1-phenyl-ethyl]-methyl-amide | CHEMBL197123
TypeSmall organic molecule
Emp. Form.C23H29N3O5S
Mol. Mass.459.558
SMILESCN([C@H](CN1CC[C@H](O)C1)c1ccccc1)C(=O)C1CCc2cc(ccc2O1)S(N)(=O)=O