Reaction Details
TargetPlasma kallikrein
LigandBDBM50175075
Substrate/Competitorn/a
Meas. Tech.ChEMBL_326966 (CHEMBL853302)
Ki>19400±n/a nM
Citation Shi, YZhang, JStein, PDShi, MO'Connor, SPBisaha, SNLi, CAtwal, KSBisacchi, GSSitkoff, DPudzianowski, ATLiu, ECHartl, KSSeiler, SMYoussef, SSteinbacher, TESchumacher, WARendina, ARBozarth, JMPeterson, TLZhang, GZahler, R Ketene aminal-based lactam derivatives as a novel class of orally active FXa inhibitors. Bioorg Med Chem Lett15:5453-8 (2005) 
 
Plasma kallikrein
Name:Plasma kallikrein
Type:Protein
Mol. Mass.:71391.16
Organism:Homo sapiens (Human)
Description:P03952
Residue:638
BDBM50175075
NameBDBM50175075
Synonyms:(S,Z)-4-hydroxybutyl 2-cyano-3-(2-methylbenzofuran-5-ylamino)-3-(2-oxo-1-(2-oxo-2-(pyrrolidin-1-yl)ethyl)azepan-3-ylamino)acrylate | CHEMBL198629
TypeSmall organic molecule
Emp. Form.C29H37N5O6
Mol. Mass.551.634
SMILESCc1cc2cc(ccc2o1)N=C(N[C@H]1CCCCN(CC(=O)N2CCCC2)C1=O)C(C#N)C(=O)OCCCCO