Reaction Details
TargetCoagulation factor X
LigandBDBM50175082
Substrate/Competitorn/a
Meas. Tech.ChEMBL_326962 (CHEMBL853297)
IC50 658±n/a nM
Citation Shi, YZhang, JStein, PDShi, MO'Connor, SPBisaha, SNLi, CAtwal, KSBisacchi, GSSitkoff, DPudzianowski, ATLiu, ECHartl, KSSeiler, SMYoussef, SSteinbacher, TESchumacher, WARendina, ARBozarth, JMPeterson, TLZhang, GZahler, R Ketene aminal-based lactam derivatives as a novel class of orally active FXa inhibitors. Bioorg Med Chem Lett15:5453-8 (2005) 
 
Coagulation factor X
Name:Coagulation factor X
Type:Enzyme
Mol. Mass.:54726.60
Organism:Homo sapiens (Human)
Description:n/a
Residue:488
BDBM50175082
NameBDBM50175082
Synonyms:(S,Z)-diethyl 1-cyano-2-(2-methylbenzofuran-5-ylamino)-2-(2-oxo-1-(2-oxo-2-(pyrrolidin-1-yl)ethyl)azepan-3-ylamino)vinylphosphonate | CHEMBL197337
TypeSmall organic molecule
Emp. Form.C28H38N5O6P
Mol. Mass.571.605
SMILESCCOP(=O)(OCC)C(C#N)C(N[C@H]1CCCCN(CC(=O)N2CCCC2)C1=O)=Nc1ccc2oc(C)cc2c1