Reaction Details
TargetCoagulation factor X
LigandBDBM50175083
Substrate/Competitorn/a
Meas. Tech.ChEMBL_326962 (CHEMBL853297)
IC50 51±n/a nM
Citation Shi, YZhang, JStein, PDShi, MO'Connor, SPBisaha, SNLi, CAtwal, KSBisacchi, GSSitkoff, DPudzianowski, ATLiu, ECHartl, KSSeiler, SMYoussef, SSteinbacher, TESchumacher, WARendina, ARBozarth, JMPeterson, TLZhang, GZahler, R Ketene aminal-based lactam derivatives as a novel class of orally active FXa inhibitors. Bioorg Med Chem Lett15:5453-8 (2005) 
 
Coagulation factor X
Name:Coagulation factor X
Type:Enzyme
Mol. Mass.:54726.60
Organism:Homo sapiens (Human)
Description:n/a
Residue:488
BDBM50175083
NameBDBM50175083
Synonyms:(S,Z)-3-(1-(2-methylbenzofuran-5-ylamino)-2-nitrovinylamino)-1-(2-oxo-2-(pyrrolidin-1-yl)ethyl)azepan-2-one | CHEMBL200768
TypeSmall organic molecule
Emp. Form.C23H29N5O5
Mol. Mass.455.5069
SMILESCc1cc2cc(NC(C[N+]([O-])=O)=N[C@H]3CCCCN(CC(=O)N4CCCC4)C3=O)ccc2o1