Reaction Details
TargetP2Y purinoceptor 12
LigandBDBM50118223
Substrate/Competitorn/a
Meas. Tech.ChEMBL_326588 (CHEMBL863371)
Kd 4.57±n/a nM
Citation El-Tayeb, AGriessmeier, KJMüller, CE Synthesis and preliminary evaluation of [3H]PSB-0413, a selective antagonist radioligand for platelet P2Y12 receptors. Bioorg Med Chem Lett15:5450-2 (2005) 
 
P2Y purinoceptor 12
Name:P2Y purinoceptor 12
Type:Enzyme
Mol. Mass.:39458.48
Organism:Homo sapiens (Human)
Description:Q9H244
Residue:342
BDBM50118223
NameBDBM50118223
Synonyms:AR-C67085 CHEMBL336292 | CHEMBL369928
TypeSmall organic molecule
Emp. Form.C14H22Cl2N5O12P3S
Mol. Mass.648.243
SMILESCCCSc1nc(N)c2ncn([C@@H]3O[C@H](COP(O)(=O)OP(O)(=O)C(Cl)(Cl)P(O)(O)=O)[C@@H](O)[C@H]3O)c2n1