Reaction Details
TargetTyrosine-protein kinase Lck
LigandBDBM50175200
Substrate/Competitorn/a
Meas. Tech.ChEMBL_328615 (CHEMBL864487)
IC50 23±n/a nM
Citation Burchat, ABorhani, DWCalderwood, DJHirst, GCLi, BStachlewitz, RF Discovery of A-770041, a src-family selective orally active lck inhibitor that prevents organ allograft rejection. Bioorg Med Chem Lett16:118-22 (2005) 
 
Tyrosine-protein kinase Lck
Name:Tyrosine-protein kinase Lck
Type:n/a
Mol. Mass.:57987.83
Organism:Homo sapiens (Human)
Description:P06239
Residue:509
BDBM50175200
NameBDBM50175200
Synonyms:CHEMBL371295 | N-(4-(4-amino-1-(1-(1-methylpiperidin-4-yl)piperidin-4-yl)-1H-pyrazolo[3,4-d]pyrimidin-3-yl)-2-methoxyphenyl)-2-fluoro-4-(trifluoromethyl)benzamide
TypeSmall organic molecule
Emp. Form.C31H34F4N8O2
Mol. Mass.626.6477
SMILESCOc1cc(ccc1NC(=O)c1ccc(cc1F)C(F)(F)F)-c1nn(C2CCN(CC2)C2CCN(C)CC2)c2ncnc(N)c12