Reaction Details
TargetTyrosine-protein kinase Lck
LigandBDBM50175195
Substrate/Competitorn/a
Meas. Tech.ChEMBL_328615 (CHEMBL864487)
IC50 74±n/a nM
Citation Burchat, ABorhani, DWCalderwood, DJHirst, GCLi, BStachlewitz, RF Discovery of A-770041, a src-family selective orally active lck inhibitor that prevents organ allograft rejection. Bioorg Med Chem Lett16:118-22 (2005) 
 
Tyrosine-protein kinase Lck
Name:Tyrosine-protein kinase Lck
Type:n/a
Mol. Mass.:57987.83
Organism:Homo sapiens (Human)
Description:P06239
Residue:509
BDBM50175195
NameBDBM50175195
Synonyms:CHEMBL370773 | N-(4-(1-(1-(1-acetylpiperidin-4-yl)piperidin-4-yl)-4-amino-1H-pyrazolo[3,4-d]pyrimidin-3-yl)-2-methoxyphenyl)-1-methyl-1H-indole-2-carboxamide
TypeSmall organic molecule
Emp. Form.C34H39N9O3
Mol. Mass.621.732
SMILESCOc1cc(ccc1NC(=O)c1cc2ccccc2n1C)-c1nn(C2CCN(CC2)C2CCN(CC2)C(C)=O)c2ncnc(N)c12