Reaction Details
TargetTyrosine-protein kinase Fyn
LigandBDBM50175205
Substrate/Competitorn/a
Meas. Tech.ChEMBL_328616 (CHEMBL864488)
IC50>50000±n/a nM
Citation Burchat, ABorhani, DWCalderwood, DJHirst, GCLi, BStachlewitz, RF Discovery of A-770041, a src-family selective orally active lck inhibitor that prevents organ allograft rejection. Bioorg Med Chem Lett16:118-22 (2005) 
 
Tyrosine-protein kinase Fyn
Name:Tyrosine-protein kinase Fyn
Type:Enzyme
Mol. Mass.:60762.21
Organism:Homo sapiens (Human)
Description:P06241
Residue:537
BDBM50175205
NameBDBM50175205
Synonyms:CHEMBL200587 | N-(4-(4-amino-1-(piperidin-4-yl)-1H-pyrazolo[3,4-d]pyrimidin-3-yl)-2-methoxyphenyl)-2-fluoro-4-(trifluoromethyl)benzamide
TypeSmall organic molecule
Emp. Form.C25H23F4N7O2
Mol. Mass.529.4894
SMILESCOc1cc(ccc1NC(=O)c1ccc(cc1F)C(F)(F)F)-c1nn(C2CCNCC2)c2ncnc(N)c12