Reaction Details
TargetTyrosine-protein kinase Fyn
LigandBDBM50175210
Substrate/Competitorn/a
Meas. Tech.ChEMBL_328616 (CHEMBL864488)
IC50 13600±n/a nM
Citation Burchat, ABorhani, DWCalderwood, DJHirst, GCLi, BStachlewitz, RF Discovery of A-770041, a src-family selective orally active lck inhibitor that prevents organ allograft rejection. Bioorg Med Chem Lett16:118-22 (2005) 
 
Tyrosine-protein kinase Fyn
Name:Tyrosine-protein kinase Fyn
Type:Enzyme
Mol. Mass.:60762.21
Organism:Homo sapiens (Human)
Description:P06241
Residue:537
BDBM50175210
NameBDBM50175210
Synonyms:CHEMBL199438 | N-(4-(4-amino-1-(1-(tetrahydro-2H-pyran-4-yl)piperidin-4-yl)-1H-pyrazolo[3,4-d]pyrimidin-3-yl)-2-methoxyphenyl)-5-chloro-1-methyl-1H-indole-2-carboxamide
TypeSmall organic molecule
Emp. Form.C32H35ClN8O3
Mol. Mass.615.125
SMILESCOc1cc(ccc1NC(=O)c1cc2cc(Cl)ccc2n1C)-c1nn(C2CCN(CC2)C2CCOCC2)c2ncnc(N)c12