Reaction Details
TargetM-phase inducer phosphatase 3
LigandBDBM50106497
Substrate/Competitorn/a
Meas. Tech.ChEMBL_328904 (CHEMBL858783)
IC50 250±n/a nM
Citation Lavergne, OFernandes, ACBréhu, LSidhu, ABrézak, MCPrévost, GDucommun, BContour-Galcera, MO Synthesis and biological evaluation of novel heterocyclic quinones as inhibitors of the dual specificity protein phosphatase CDC25C. Bioorg Med Chem Lett16:171-5 (2005) 
 
M-phase inducer phosphatase 3
Name:M-phase inducer phosphatase 3
Type:Substrate
Mol. Mass.:53366.11
Organism:Homo sapiens (Human)
Description:P30307
Residue:473
BDBM50106497
NameBDBM50106497
Synonyms:6-Chloro-7-(2-morpholin-4-yl-ethylamino)-quinoline-5,8-dione CHEMBL337173 | NSC-663284
TypeSmall organic molecule
Emp. Form.C15H16ClN3O3
Mol. Mass.321.759
SMILESOc1c(Cl)c(N=CCN2CCOCC2)c(O)c2ncccc12