Reaction Details
TargetVascular endothelial growth factor receptor 2
LigandBDBM4621
Substrate/Competitorn/a
Meas. Tech.ChEMBL_328596 (CHEMBL864485)
IC50 1500±n/a nM
Citation Han, SYPark, SSLee, WGMin, YKKim, BT Synthesis of a novel biotin-tagged photoaffinity probe for VEGF receptor tyrosine kinases. Bioorg Med Chem Lett16:129-33 (2005) 
 
Vascular endothelial growth factor receptor 2
Name:Vascular endothelial growth factor receptor 2
Type:Receptor Tyrosine Kinase
Mol. Mass.:151510.97
Organism:Homo sapiens (Human)
Description:P35968
Residue:1356
BDBM4621
NameBDBM4621
Synonyms:Anilinoquinazoline deriv. 4 N-(4-chloro-2-fluorophenyl)-6,7-dimethoxyquinazolin-4-amine
TypeSmall organic molecule
Emp. Form.C16H13ClFN3O2
Mol. Mass.333.745
SMILESCOc1cc2ncnc(Nc3ccc(Cl)cc3F)c2cc1OC