Reaction Details
TargetCaspase-1
LigandBDBM50175341
Substrate/Competitorn/a
Meas. Tech.ChEMBL_326950 (CHEMBL860329)
IC50 5±n/a nM
Citation O'Neil, SVWang, YLaufersweiler, MCOppong, KASoper, DLWos, JAEllis, CDBaize, MWBosch, GKFancher, ANLu, WSuchanek, MKWang, RLDe, BDemuth, TP Synthesis and evaluation of novel 8,6-fused bicyclic peptidomimetic compounds as interleukin-1beta converting enzyme inhibitors. Bioorg Med Chem Lett15:5434-8 (2005) 
 
Caspase-1
Name:Caspase-1
Type:Enzyme
Mol. Mass.:45154.13
Organism:Homo sapiens (Human)
Description:P29466
Residue:404
BDBM50175341
NameBDBM50175341
Synonyms:(4S,7S,11aS)-7-benzamido-N4-((3S)-2-hydroxy-5-oxo-tetrahydrofuran-3-yl)-6-oxo-N2-phenyl-octahydro-1H-pyrazino[1,2-a]azocine-2,4(6H)-dicarboxamide | CHEMBL380780
TypeSmall organic molecule
Emp. Form.C29H33N5O7
Mol. Mass.563.6016
SMILESOC1OC(=O)C[C@@H]1NC(=O)[C@@H]1CN(C[C@@H]2CCCC[C@H](NC(=O)c3ccccc3)C(=O)N12)C(=O)Nc1ccccc1