Reaction Details
TargetCaspase-1
LigandBDBM50175327
Substrate/Competitorn/a
Meas. Tech.ChEMBL_326950 (CHEMBL860329)
IC50 1±n/a nM
Citation O'Neil, SVWang, YLaufersweiler, MCOppong, KASoper, DLWos, JAEllis, CDBaize, MWBosch, GKFancher, ANLu, WSuchanek, MKWang, RLDe, BDemuth, TP Synthesis and evaluation of novel 8,6-fused bicyclic peptidomimetic compounds as interleukin-1beta converting enzyme inhibitors. Bioorg Med Chem Lett15:5434-8 (2005) 
 
Caspase-1
Name:Caspase-1
Type:Enzyme
Mol. Mass.:45154.13
Organism:Homo sapiens (Human)
Description:P29466
Residue:404
BDBM50175327
NameBDBM50175327
Synonyms:(4S,7S,11aS)-N-((3S)-2-hydroxy-5-oxo-tetrahydrofuran-3-yl)-7-(isoquinoline-1-carboxamido)-6-oxo-decahydro-[1,4]oxazino[4,3-a]azocine-4-carboxamide | CHEMBL196753
TypeSmall organic molecule
Emp. Form.C25H28N4O7
Mol. Mass.496.5124
SMILESOC1OC(=O)C[C@@H]1NC(=O)[C@@H]1COC[C@@H]2CCCC[C@H](NC(=O)c3nccc4ccccc34)C(=O)N12