Reaction Details
TargetCaspase-1
LigandBDBM50175326
Substrate/Competitorn/a
Meas. Tech.ChEMBL_326950 (CHEMBL860329)
IC50 1±n/a nM
Citation O'Neil, SVWang, YLaufersweiler, MCOppong, KASoper, DLWos, JAEllis, CDBaize, MWBosch, GKFancher, ANLu, WSuchanek, MKWang, RLDe, BDemuth, TP Synthesis and evaluation of novel 8,6-fused bicyclic peptidomimetic compounds as interleukin-1beta converting enzyme inhibitors. Bioorg Med Chem Lett15:5434-8 (2005) 
 
Caspase-1
Name:Caspase-1
Type:Enzyme
Mol. Mass.:45154.13
Organism:Homo sapiens (Human)
Description:P29466
Residue:404
BDBM50175326
NameBDBM50175326
Synonyms:(4S,7S,11aS)-N-((3S)-2-hydroxy-5-oxo-tetrahydrofuran-3-yl)-7-(isoquinoline-1-carboxamido)-6-oxo-2-(phenylsulfonyl)-decahydro-1H-pyrazino[1,2-a]azocine-4-carboxamide | CHEMBL381667
TypeSmall organic molecule
Emp. Form.C31H33N5O8S
Mol. Mass.635.687
SMILESOC1OC(=O)C[C@@H]1NC(=O)[C@@H]1CN(C[C@@H]2CCCC[C@H](NC(=O)c3nccc4ccccc34)C(=O)N12)S(=O)(=O)c1ccccc1