Reaction Details
TargetExtracellular calcium-sensing receptor
LigandBDBM50175361
Substrate/Competitorn/a
Meas. Tech.ChEMBL_326644 (CHEMBL863377)
IC50 1350±n/a nM
Citation Gavai, AVVaz, RJMikkilineni, ABRoberge, JYLiu, YLawrence, RMCorte, JRYang, WBednarz, MDickson, JKMa, ZSeethala, RFeyen, JH Discovery of novel 1-arylmethyl pyrrolidin-2-yl ethanol amines as calcium-sensing receptor antagonists. Bioorg Med Chem Lett15:5478-82 (2005) 
 
Extracellular calcium-sensing receptor
Name:Extracellular calcium-sensing receptor
Type:Protein
Mol. Mass.:120663.13
Organism:Homo sapiens (Human)
Description:P41180
Residue:1078
BDBM50175361
NameBDBM50175361
Synonyms:3-(((R)-2-((R)-2-(1-(benzo[d]thiazol-2-yl)-2-methylpropan-2-ylamino)-1-hydroxyethyl)pyrrolidin-1-yl)methyl)benzonitrile | CHEMBL381685
TypeSmall organic molecule
Emp. Form.C25H30N4OS
Mol. Mass.434.597
SMILESCC(C)(Cc1nc2ccccc2s1)NC[C@@H](O)[C@H]1CCCN1Cc1cccc(c1)C#N