Reaction Details
TargetExtracellular calcium-sensing receptor
LigandBDBM50175362
Substrate/Competitorn/a
Meas. Tech.ChEMBL_326644 (CHEMBL863377)
IC50 250±n/a nM
Citation Gavai, AVVaz, RJMikkilineni, ABRoberge, JYLiu, YLawrence, RMCorte, JRYang, WBednarz, MDickson, JKMa, ZSeethala, RFeyen, JH Discovery of novel 1-arylmethyl pyrrolidin-2-yl ethanol amines as calcium-sensing receptor antagonists. Bioorg Med Chem Lett15:5478-82 (2005) 
 
Extracellular calcium-sensing receptor
Name:Extracellular calcium-sensing receptor
Type:Protein
Mol. Mass.:120663.13
Organism:Homo sapiens (Human)
Description:P41180
Residue:1078
BDBM50175362
NameBDBM50175362
Synonyms:4-(((R)-2-((R)-1-hydroxy-2-(2-methyl-1-(naphthalen-2-yl)propan-2-ylamino)ethyl)pyrrolidin-1-yl)methyl)benzonitrile | CHEMBL199548
TypeSmall organic molecule
Emp. Form.C28H33N3O
Mol. Mass.427.5811
SMILESCC(C)(Cc1ccc2ccccc2c1)NC[C@@H](O)[C@H]1CCCN1Cc1ccc(cc1)C#N