Reaction Details
TargetExtracellular calcium-sensing receptor
LigandBDBM50175375
Substrate/Competitorn/a
Meas. Tech.ChEMBL_326644 (CHEMBL863377)
IC50 60±n/a nM
Citation Gavai, AVVaz, RJMikkilineni, ABRoberge, JYLiu, YLawrence, RMCorte, JRYang, WBednarz, MDickson, JKMa, ZSeethala, RFeyen, JH Discovery of novel 1-arylmethyl pyrrolidin-2-yl ethanol amines as calcium-sensing receptor antagonists. Bioorg Med Chem Lett15:5478-82 (2005) 
 
Extracellular calcium-sensing receptor
Name:Extracellular calcium-sensing receptor
Type:Protein
Mol. Mass.:120663.13
Organism:Homo sapiens (Human)
Description:P41180
Residue:1078
BDBM50175375
NameBDBM50175375
Synonyms:(S)-2-(3-(1-(benzo[b]thiophen-2-yl)-2-methylpropan-2-ylamino)-2-hydroxypropoxy)benzonitrile | CHEMBL199894
TypeSmall organic molecule
Emp. Form.C22H24N2O2S
Mol. Mass.380.503
SMILESCC(C)(Cc1cc2ccccc2s1)NC[C@H](O)COc1ccccc1C#N