Reaction Details
TargetExtracellular calcium-sensing receptor
LigandBDBM50175378
Substrate/Competitorn/a
Meas. Tech.ChEMBL_326644 (CHEMBL863377)
IC50 360±n/a nM
Citation Gavai, AVVaz, RJMikkilineni, ABRoberge, JYLiu, YLawrence, RMCorte, JRYang, WBednarz, MDickson, JKMa, ZSeethala, RFeyen, JH Discovery of novel 1-arylmethyl pyrrolidin-2-yl ethanol amines as calcium-sensing receptor antagonists. Bioorg Med Chem Lett15:5478-82 (2005) 
 
Extracellular calcium-sensing receptor
Name:Extracellular calcium-sensing receptor
Type:Protein
Mol. Mass.:120663.13
Organism:Homo sapiens (Human)
Description:P41180
Residue:1078
BDBM50175378
NameBDBM50175378
Synonyms:(R)-1-((R)-1-(2,3-difluorobenzyl)pyrrolidin-2-yl)-2-(2-methyl-1-(naphthalen-2-yl)propan-2-ylamino)ethanol | CHEMBL200690
TypeSmall organic molecule
Emp. Form.C27H32F2N2O
Mol. Mass.438.5526
SMILESCC(C)(Cc1ccc2ccccc2c1)NC[C@@H](O)[C@H]1CCCN1Cc1cccc(F)c1F