Reaction Details
TargetEstrogen receptor beta
LigandBDBM50175412
Substrate/Competitorn/a
Meas. Tech.ChEMBL_326623 (CHEMBL868723)
IC50 11.9±n/a nM
Citation Chesworth, RWessel, MDHeyden, LMangano, FMZawistoski, MGegnas, LGalluzzo, DLefker, BCameron, KOTickner, JLu, BCastleberry, TAPetersen, DNBrault, APerry, PNg, OOwen, TAPan, LKe, HZBrown, TAThompson, DDDaSilva-Jardine, P Estrogen receptor beta selective ligands: discovery and SAR of novel heterocyclic ligands. Bioorg Med Chem Lett15:5562-6 (2005) 
 
Estrogen receptor beta
Name:Estrogen receptor beta
Type:Protein
Mol. Mass.:59238.43
Organism:Homo sapiens (Human)
Description:Q92731
Residue:530
BDBM50175412
NameBDBM50175412
Synonyms:4-(3-(4-hydroxyphenyl)-1H-indol-2-yl)phenol | CHEMBL200232
TypeSmall organic molecule
Emp. Form.C20H15NO2
Mol. Mass.301.3386
SMILESOc1ccc(cc1)-c1[nH]c2ccccc2c1-c1ccc(O)cc1