Reaction Details
Target5-hydroxytryptamine receptor 1A
LigandBDBM50175485
Substrate/Competitorn/a
Meas. Tech.ChEMBL_326565 (CHEMBL859776)
Ki 0.4±n/a nM
Citation Kling, ALange, UEMack, HBakker, MHDrescher, KUHornberger, WHutchins, CWMöller, AMüller, RSchmidt, MUnger, LWicke, KSchellhaas, KSteiner, G Synthesis and SAR of highly potent dual 5-HT1A and 5-HT1B antagonists as potential antidepressant drugs. Bioorg Med Chem Lett15:5567-73 (2005) 
 
5-hydroxytryptamine receptor 1A
Name:5-hydroxytryptamine receptor 1A
Type:n/a
Mol. Mass.:46122.49
Organism:Homo sapiens (Human)
Description:n/a
Residue:422
BDBM50175485
NameBDBM50175485
Synonyms:3-[2-(4-benzo[b]thiophen-7-yl-piperazin-1-yl)-ethyl]-7-methyl-5,6,7,8-tetrahydro-3H-pyrido[4',3':4,5]thieno[2,3-d]pyrimidin-4-one | CHEMBL197344
TypeSmall organic molecule
Emp. Form.C24H27N5OS2
Mol. Mass.465.634
SMILESCN1CCc2c(C1)sc1ncn(CCN3CCN(CC3)c3cccc4ccsc34)c(=O)c21