Reaction Details
TargetInterstitial collagenase
LigandBDBM50175551
Substrate/Competitorn/a
Meas. Tech.ChEMBL_320812 (CHEMBL872347)
Ki 33±n/a nM
Citation Alberts, ILTodorov, NPDean, PM Receptor flexibility in de novo ligand design and docking. J Med Chem48:6585-96 (2005) 
 
Interstitial collagenase
Name:Interstitial collagenase
Type:Enzyme
Mol. Mass.:54010.26
Organism:Homo sapiens (Human)
Description: P03956
Residue:469
BDBM50175551
NameBDBM50175551
Synonyms:CHEMBL366010 | N-Hydroxy-4-(4-methoxy-phenyl)-4-oxo-butyramide
TypeSmall organic molecule
Emp. Form.C11H13NO4
Mol. Mass.223.2252
SMILESCOc1ccc(cc1)C(=O)CCC(=O)NO