Reaction Details
TargetInterstitial collagenase
LigandBDBM50175564
Substrate/Competitorn/a
Meas. Tech.ChEMBL_321355 (CHEMBL881499)
IC50 1.3±n/a nM
Citation Alberts, ILTodorov, NPDean, PM Receptor flexibility in de novo ligand design and docking. J Med Chem48:6585-96 (2005) 
 
Interstitial collagenase
Name:Interstitial collagenase
Type:Enzyme
Mol. Mass.:54010.26
Organism:Homo sapiens (Human)
Description: P03956
Residue:469
BDBM50175564
NameBDBM50175564
Synonyms:CHEMBL198634 | N-Hydroxy-2-(7-oxo-7,8-dihydro-6H-quinolizine-4-sulfonylamino)-acetamide
TypeSmall organic molecule
Emp. Form.C11H13N3O5S
Mol. Mass.299.303
SMILESONC(=O)CNS(=O)(=O)C1=CC=CC2=CCC(=O)CN12